{"text_format":"2","workbook":"xlsx","n_sheets":17,"sheets":["Manual","Indata","Anpassning","Variabler","Ändringar-Kompletteringar","Offert","Extra 1","Extra 2","Materialspec med pris","Materialspec utan pris","Materialspec grönt bidrag","Ekonom.spec grönt bidrag","Panelsektorer","Lagar & Regler","Formler","Beräkningar","Azimut"],"not_rendered":{"charts":0,"images":3,"macros":1,"external_links":0,"defined_names":129,"comments":0,"pivot_tables":0},"unopened":[],"bounds":{"document_bytes":16777216,"sheet_cells":100000,"run_cost":"one","rows_first":2000,"rows_last":500,"rows_between":2000,"halvings":0,"cell_chars":16384,"cell_head_chars":4096},"cells_cut":0,"cells_raw":0,"read":"whole","date_system":"1900"}

{"sheet":"Manual","index":0,"n_rows":136,"n_cols":4,"rows_kept":136,"cut":false,"hidden":false,"merged":[]}
[]
[]
[null,null,"Kort manual för Billma-kalkylen."]
[]
[null,null,"Avsikten med kalkylprogrammet är att det skall vara lätt att kalkylera och offerera ett project."]
[null,null,"I kalkylprogrammet finns många inbyggda funktioner. Nedanstående flikar finns att välja bland."]
[null,null,"Kom ihåg:  Vita fält går att ändra, övriga fält är låsta."]
[]
[null,null,"OBS!  Tänk på att nollställa värden i flikarna \"Variabler\" och \"Ändringar-Kompletteringar\"  vid ny kalkyl."]
[]
{"$rows_left_out":127}
{"sheet":"Indata","index":1,"n_rows":61,"n_cols":27,"rows_kept":61,"cut":false,"hidden":false,"merged":[[54,7,54,10],[54,12,54,14],[57,3,57,4],[58,3,58,4],[59,3,59,4],[55,3,55,4],[53,3,53,4],[57,7,57,10],[47,12,47,14],[48,12,48,14],[54,3,54,4],[56,3,56,4],[49,12,49,14],[51,12,51,14],[52,12,52,14],[55,12,55,14],[50,12,50,14],[59,12,59,14],[50,3,50,4],[53,12,53,14],[57,12,57,14],[55,7,55,10],[53,7,53,10],[52,7,52,10],[51,7,51,10],[10,6,10,9],[10,11,10,12],[6,7,6,9],[35,1,35,3],[36,1,36,3],[20,13,20,15],[23,9,23,11],[5,3,5,5],[6,3,6,5],[15,10,15,11],[16,10,16,11],[24,10,24,11],[28,13,28,15],[29,13,29,15],[26,10,26,11],[36,12,36,14],[33,7,33,11],[25,10,25,11],[32,12,32,13],[33,12,33,13],[34,12,34,13],[35,12,35,13],[46,12,46,14],[2,3,2,5],[3,3,3,5],[4,3,4,5],[4,7,4,9],[5,7,5,9],[2,7,2,9],[2,10,2,13],[9,6,9,9],[9,11,9,12],[3,7,3,9],[3,10,3,15],[4,10,4,15],[5,10,5,15],[6,10,6,15],[8,11,8,12],[9,4,9,5],[49,7,49,10],[46,7,46,10],[47,7,47,10],[46,3,46,4],[47,3,47,4],[48,3,48,4],[49,3,49,4],[35,7,35,11],[36,7,36,11],[39,4,39,5],[40,4,40,5],[41,4,41,5],[41,7,41,13],[42,7,42,13],[11,6,11,9],[11,11,11,12],[37,12,37,14],[37,7,37,11],[27,10,27,11],[28,10,28,11],[29,10,29,11],[32,7,32,11],[34,7,34,11],[31,12,31,13],[19,13,19,15],[15,3,15,5],[34,1,34,3],[17,3,17,5],[24,3,24,5],[38,12,38,14],[39,12,39,14],[42,4,42,5],[14,9,14,11],[20,10,20,11],[33,1,33,3],[26,3,26,5],[38,7,38,11],[39,7,39,11],[17,10,17,11],[18,10,18,11],[19,10,19,11],[37,1,37,3],[32,1,32,3]]}
[{"$nulls":10},"Prisberäkning"]
[null,"Kund"]
[null,"Namn",{"$nulls":5},"Datum",null,null,{"$f":"TODAY()","v":"2026-06-26"},{"$nulls":6},1]
[null,"Adress",{"$nulls":5},"Personnr.",null,null," "]
[null,"Postnr/ Ort",{"$nulls":5},"Projekt",null,null," "]
[null,"Tel",{"$nulls":5},"Fastigh.bet.",null,null," "]
[null,"Email",{"$nulls":5},"Leveranstid",null,null," "]
[]
[{"$nulls":11},"Tak 1",null,null,"Tak 2"]
[null,"Välj prislista",null,"BÅFP",{"$f":"IF(D10=\"BUTP\",\"Till Anpassning\",\"\")","v":""},null,"Huvudsäkr. ",{"$nulls":4},16,null,null,35,null,null,2]
{"$rows_left_out":52}
{"sheet":"Anpassning","index":2,"n_rows":51,"n_cols":15,"rows_kept":51,"cut":false,"hidden":false,"merged":[[9,11,9,12],[46,4,46,7],[47,4,47,7],[48,4,48,7],[15,12,15,13],[15,5,15,8],[16,5,16,8],[17,5,17,8],[20,9,20,11],[19,12,19,13],[20,12,20,13],[33,3,33,13],[34,3,34,13],[29,3,29,13],[30,3,30,13],[18,12,18,13],[49,4,49,7],[39,3,39,4],[39,5,39,9],[39,10,39,13],[40,10,40,13],[41,10,41,13],[40,3,40,4],[41,3,41,4],[40,5,40,9],[41,5,41,9],[3,11,3,12],[5,11,5,12],[4,11,4,12],[6,11,6,12],[32,3,32,13],[31,3,31,13],[26,3,26,9],[26,13,26,14],[19,5,19,8],[19,14,19,15],[20,5,20,8],[19,9,19,11],[15,14,15,15],[20,14,20,15],[18,5,18,8],[18,9,18,11],[18,14,18,15],[17,14,17,15],[16,9,16,11],[17,9,17,11],[16,14,16,15],[17,12,17,13],[16,12,16,13]]}
[]
[]
[null,null,null,"Påslag material  %",{"$nulls":5},"Arbetskostnad per watt",{"$nulls":4}," "]
[null,null,null," ","(enb. Kod (BUTP)"]
[null,null,null,"Växelriktare",0.05,null,null," ",null,"Paneler",null,0,null,"W        Tot",{"$f":"Formler!M91*Anpassning!L5","v":0}]
[null,null,null,"Batterier",7.0000000000000007E-2,{"$nulls":6},"  "]
[null,null,null,"Paneler",0.1,{"$nulls":4},"El",null,0,null,"W        Tot",{"$f":"Formler!M91*Anpassning!L7","v":0}]
[null,null,null,"Underkonstruktion",0.12,{"$nulls":4},{"$f":"Indata!M33*Indata!D19","v":0}]
[null,null,null,"Övrigt elmaterial",0.15,{"$nulls":4},"Andel av totalt elarbete för bidrag 48,5%"]
[null,null,null," "," ",{"$nulls":4},"El=48,5%",null,0,null,"%         =",{"$f":"IF(Formler!N85=TRUE,O7*L10,0)","v":0}]
{"$rows_left_out":42}
{"sheet":"Variabler","index":3,"n_rows":28,"n_cols":9,"rows_kept":28,"cut":false,"hidden":false,"merged":[[3,3,3,8],[4,3,4,8],[27,2,27,9]]}
[]
[]
[null,null,null,"Variabler 2  (mått)"]
[null,null,null,"(Ange avstånd mellan fästpunkter.)"]
[null,null,null,"(Om 0 anges i \"Ändra\" gäller \"Kalkyl\")"]
[{"$nulls":6},"Tak 1",null,"Tak 2"]
[{"$nulls":4},"Kalkyl",null,"Ändra",null,"Ändra"]
[null,null,null,"Hangerbolt H",1.05,null,0,null,0]
[null,null,null,"Hangerbolt V",0.75,null,0,null,0]
[null,null,null,"Tegelkrok H",1.05,null,0,null,0]
{"$rows_left_out":19}
{"sheet":"Ändringar-Kompletteringar","index":4,"n_rows":92,"n_cols":14,"rows_kept":92,"cut":false,"hidden":false,"merged":[[1,1,1,4],[2,1,2,2],[4,1,4,5]]}
[]
[null,"Ändringar / Kompletteringar till aktuella kalkyler  (OBS !  GÄLLER FÖR TOTAL KALKYL)"]
[null,"Lägga till:  Ange antal att addera,   Ta bort: Ange antal med minustecken. ",null,"Beräknat i","Ändra /"]
[]
[null,"OBS! Kolla summarutan längst ner, skall vara noll när du startar ny kalkyl."]
[null,null,null,"kalkyl","Lägg till","Nytt antal"]
[null,"Art.nr.","Artikelnamn","Kolumn1","Antal","Kolumn2"]
[null,{"$f":"Beräkningar!C9","v":"1010001-005"},{"$f":"Beräkningar!D9","v":"AFORE Växelriktare 5,0 KW"},{"$f":"Beräkningar!K9","v":0},0,{"$f":"Tabell1721[[#This Row],[Kolumn1]]+Tabell1721[[#This Row],[Antal]]","v":0},{"$nulls":7}," "]
[null,{"$f":"Beräkningar!C10","v":"1010001-006"},{"$f":"Beräkningar!D10","v":"AFORE Växelriktare 6,0 KW"},{"$f":"Beräkningar!K10","v":0},0,{"$f":"Tabell1721[[#This Row],[Kolumn1]]+Tabell1721[[#This Row],[Antal]]","v":0}]
[null,{"$f":"Beräkningar!C11","v":"1010001-008"},{"$f":"Beräkningar!D11","v":"AFORE Växelriktare 8,0 KW"},{"$f":"Beräkningar!K11","v":0},0,{"$f":"Tabell1721[[#This Row],[Kolumn1]]+Tabell1721[[#This Row],[Antal]]","v":0},null,null,null," "]
{"$rows_left_out":83}
{"sheet":"Offert","index":5,"n_rows":56,"n_cols":11,"rows_kept":56,"cut":false,"hidden":false,"merged":[[45,9,45,10],[3,10,3,11],[21,9,21,10],[22,9,22,10],[23,9,23,10],[24,9,24,10],[55,1,55,10],[12,3,12,4],[5,1,5,3],[10,3,10,4],[11,3,11,4],[8,3,8,4],[9,3,9,4],[13,3,13,4],[8,7,8,10],[9,7,9,10],[10,7,10,10],[12,7,12,8],[25,9,25,10],[26,9,26,10],[43,9,43,10],[44,9,44,10]]}
[]
[]
[]
[{"$nulls":6},"OFFERT",null,"Datum",null,{"$f":"TODAY()","v":"2026-06-26"}]
[]
[]
[]
[]
[null,"Köpare:",null,{"$f":"Indata!D3","v":0},null,null,"Vår ref:",{"$f":"Indata!M60","v":" "}]
[null,"Adress:",null,{"$f":"Indata!D4","v":0},null,null,"Mail:",{"$f":"IF(H9=Anpassning!D40,Anpassning!F40,IF(H9=Anpassning!D41,Anpassning!F41,IF(H9=Anpassning!D42,Anpassning!F42,\"\")))","v":" "}]
{"$rows_left_out":47}
{"sheet":"Extra 1","index":6,"n_rows":0,"n_cols":0,"rows_kept":0,"cut":false,"hidden":true,"merged":[]}

{"sheet":"Extra 2","index":7,"n_rows":0,"n_cols":0,"rows_kept":0,"cut":false,"hidden":true,"merged":[]}

{"sheet":"Materialspec med pris","index":8,"n_rows":53,"n_cols":6,"rows_kept":53,"cut":false,"hidden":false,"merged":[[5,3,5,5],[6,4,6,5],[7,4,7,5],[8,4,8,5],[9,4,9,5]]}
[]
[]
[]
[]
[]
[null,null,"Kund","Lev.adress"]
[null,"Namn",{"$f":"Indata!D3","v":0}]
[null,"Adress",{"$f":"Indata!D4","v":0}]
[null,"Postnr / ort",{"$f":"Indata!D5","v":0}]
[null,"Tel.nr",{"$f":"Indata!D6","v":0}]
{"$rows_left_out":44}
{"sheet":"Materialspec utan pris","index":9,"n_rows":53,"n_cols":6,"rows_kept":53,"cut":false,"hidden":false,"merged":[[6,4,6,5],[7,4,7,5],[8,4,8,5],[9,4,9,5]]}
[]
[]
[]
[]
[]
[null,null,"Kund",null,"Lev.adress"]
[null,"Namn",{"$f":"Indata!D3","v":0},null,"Mt816"]
[null,"Adress",{"$f":"Indata!D4","v":0}]
[null,"Postnr / ort",{"$f":"Indata!D5","v":0}]
[null,"Tel.nr",{"$f":"Indata!D6","v":0}]
{"$rows_left_out":44}
{"sheet":"Materialspec grönt bidrag","index":10,"n_rows":53,"n_cols":7,"rows_kept":53,"cut":false,"hidden":false,"merged":[[6,4,6,6],[7,4,7,6],[8,4,8,6],[9,4,9,6]]}
[]
[]
[{"$nulls":4},"Material / Prisunderlag grönt bidrag."]
[]
[]
[null,null,"Kund",null,"Lev.adress"]
[null,"Namn",{"$f":"Indata!D3","v":0}]
[null,"Adress",{"$f":"Indata!D4","v":0}]
[null,"Postnr / ort",{"$f":"Indata!D5","v":0}]
[null,"Tel.nr",{"$f":"Indata!D6","v":0}]
{"$rows_left_out":44}
{"sheet":"Ekonom.spec grönt bidrag","index":11,"n_rows":58,"n_cols":20,"rows_kept":58,"cut":false,"hidden":false,"merged":[[6,5,6,7],[14,2,14,3],[15,2,15,3],[8,1,8,8],[57,1,57,8],[19,1,19,3],[31,1,31,3],[7,1,7,2],[11,2,11,3],[11,7,11,8],[12,2,12,3],[13,7,13,8],[13,2,13,3]]}
[]
[]
[]
[{"$nulls":7},"Datum",{"$f":"TODAY()","v":"2026-06-26"}]
[]
[]
[{"$nulls":5},"Bilaga till faktura nr."]
[]
[null,"Ekonomisk specifikation för grönt bidrag gällande solcellsanläggning."]
[{"$nulls":19}," "]
{"$rows_left_out":49}
{"sheet":"Panelsektorer","index":12,"n_rows":22,"n_cols":37,"rows_kept":22,"cut":false,"hidden":false,"merged":[]}
[]
[{"$nulls":23},"Exempel panelsektorer"]
[{"$nulls":4},"Att taket delas i olika sektorer beror på ex.vis takfönster.",{"$nulls":13},"V= Liggande paneler med vertikala skenor.,  H = Stående paneler med horisontella skenor."]
[null,null,null,"2 x 3",{"$nulls":4},"2 x 3",{"$nulls":4},"2 x 4"]
[{"$nulls":21},"Båda exemplen är beräknade på Takstorlek  ca: 16,5 x 9,5 m"]
[null," ",{"$nulls":19},"Panelstorlek  113,4  x 172,2 cm"]
[null,null," "," "]
[{"$nulls":8},"3 x 14"]
[]
[]
{"$rows_left_out":13}
{"sheet":"Lagar & Regler","index":13,"n_rows":105,"n_cols":6,"rows_kept":105,"cut":false,"hidden":false,"merged":[]}
[{"$nulls":5}," "]
[null,"LAGAR / REGLER / RÅD"]
[]
[]
[null,"Grönt bidrag"]
[null,"1 januari 2023 höjdes gröna bidraget (se nästa stycke). Maxbelopp per person 50.000 kr om skattemässigt utrymmen finns."]
[null,"Tänk på att det gäller per person (per ägare i fastigheten). Detta innebär att en större anläggning där bidraget överstiger 50.000 kr"]
[null,"kan utnyttjas och fördelas på fler ägare i fastigheten om skatteutrymme finns.Slufakturan fördelas då och ställs ut på"]
[null,"på de aktuella ägarna."]
[]
{"$rows_left_out":96}
{"sheet":"Formler","index":14,"n_rows":91,"n_cols":30,"rows_kept":91,"cut":false,"hidden":true,"merged":[[25,3,25,4],[32,3,32,4]]}
[]
[{"$nulls":9},"Tak 1","Tak 2","Tak 1","Tak 2",null,"DC-BOX","Vxr 1","Vxr 2","Vxr2","Vxr3","Box1","Box2","Box3"]
[null,"Kolumn1","Totalt","Tak 1","Tak 2","Kolumn2","Kolumn3","Kolumn4","Kolumn5","Till kalkyl","Till kalkyl6","Grund","Grund7",null,"AFORE 5,0 KW",{"$f":"IF(Indata!$M$37=Tabell24[[#This Row],[DC-BOX]],Indata!$Q$37)","v":false},{"$f":"IF(Tabell24[[#This Row],[Vxr 1]]=FALSE,0,P3)","v":0},{"$f":"IF(Indata!$M$38=Tabell24[[#This Row],[DC-BOX]],Indata!$Q$38)","v":false},{"$f":"IF(Tabell24[[#This Row],[Vxr2]]=FALSE,0,R3)","v":0},0,{"$f":"Tabell24[[#This Row],[Vxr 1]]+Tabell24[[#This Row],[Vxr2]]","v":0},0]
[null," ",null," "," "," "," ",{"$nulls":7},"AFORE 6,0 KW",{"$f":"IF(Indata!$M$37=Tabell24[[#This Row],[DC-BOX]],Indata!$Q$37)","v":false},{"$f":"IF(Tabell24[[#This Row],[Vxr 1]]=FALSE,0,P4)","v":0},{"$f":"IF(Indata!$M$38=Tabell24[[#This Row],[DC-BOX]],Indata!$Q$38)","v":false},{"$f":"IF(Tabell24[[#This Row],[Vxr2]]=FALSE,0,R4)","v":0},0,{"$f":"Tabell24[[#This Row],[Vxr 1]]+Tabell24[[#This Row],[Vxr2]]","v":0},0]
[null,"Ändklämma",{"$f":"D5+E5","v":0},{"$f":"IF(Indata!C15=\"J\",Y12,0)","v":0},{"$f":"IF(Indata!C24=\"J\",Y13,0)","v":0},{"$f":"IF(Y8=0,D5,0)","v":0},{"$f":"IF(Z8=0,E5,0)","v":0},{"$nulls":7},"AFORE 8,0 KW",{"$f":"IF(Indata!$M$37=Tabell24[[#This Row],[DC-BOX]],Indata!$Q$37)","v":false},{"$f":"IF(Tabell24[[#This Row],[Vxr 1]]=FALSE,0,P5)","v":0},{"$f":"IF(Indata!$M$38=Tabell24[[#This Row],[DC-BOX]],Indata!$Q$38)","v":false},{"$f":"IF(Tabell24[[#This Row],[Vxr2]]=FALSE,0,R5)","v":0},0,{"$f":"Tabell24[[#This Row],[Vxr 1]]+Tabell24[[#This Row],[Vxr2]]","v":0},0]
[null," "," "," "," "," "," ",{"$nulls":7},"AFORE 10,0 KW",{"$f":"IF(Indata!$M$37=Tabell24[[#This Row],[DC-BOX]],Indata!$Q$37)","v":false},{"$f":"IF(Tabell24[[#This Row],[Vxr 1]]=FALSE,0,P6)","v":0},{"$f":"IF(Indata!$M$38=Tabell24[[#This Row],[DC-BOX]],Indata!$Q$38)","v":false},{"$f":"IF(Tabell24[[#This Row],[Vxr2]]=FALSE,0,R6)","v":0},0,{"$f":"Tabell24[[#This Row],[Vxr 1]]+Tabell24[[#This Row],[Vxr2]]","v":0},0]
[null,"Mittklämma",{"$f":"D7+E7","v":0},{"$f":"IF(Indata!C15=\"J\",($P$69-SUM(Indata!J17:J21))*2,0)","v":0},{"$f":"IF(Indata!C24=\"J\",($Q$69-SUM(Indata!J26:J30))*2,0)","v":0},{"$f":"IF(Y8=0,D7,0)","v":0},{"$f":"IF(Z8=0,E7,0)","v":0},{"$nulls":7},"AFORE 12,0 KW",{"$f":"IF(Indata!$M$37=Tabell24[[#This Row],[DC-BOX]],Indata!$Q$37)","v":false},{"$f":"IF(Tabell24[[#This Row],[Vxr 1]]=FALSE,0,P7)","v":0},{"$f":"IF(Indata!$M$38=Tabell24[[#This Row],[DC-BOX]],Indata!$Q$38)","v":false},{"$f":"IF(Tabell24[[#This Row],[Vxr2]]=FALSE,0,R7)","v":0},0,{"$f":"Tabell24[[#This Row],[Vxr 1]]+Tabell24[[#This Row],[Vxr2]]","v":0},0]
[null,"Montageskena",{"$f":"D8+E8","v":0},{"$f":"IF(Indata!C15=\"J\",$P$69*2*L8/4.2,0)","v":0},{"$f":"IF(Indata!C24=\"J\",$Q$69*2*M8/4.2,0)","v":0},{"$f":"IF(Tabell4[[#Totals],[Tak 1]]=1,0,ROUND(D8,0))","v":0},{"$f":"IF(Tabell4[[#Totals],[Tak 2]]=1,0,ROUND(E8,0))","v":0},{"$nulls":4},{"$f":"Q60","v":1.1840000000000002},{"$f":"S60","v":0.05},null,"AFORE 15,0 KW",{"$f":"IF(Indata!$M$37=Tabell24[[#This Row],[DC-BOX]],Indata!$Q$37)","v":0},{"$f":"IF(Tabell24[[#This Row],[Vxr 1]]=FALSE,0,P8)","v":0},{"$f":"IF(Indata!$M$38=Tabell24[[#This Row],[DC-BOX]],Indata!$Q$38)","v":false},{"$f":"IF(Tabell24[[#This Row],[Vxr2]]=FALSE,0,R8)","v":0},0,0,{"$f":"Tabell24[[#This Row],[Vxr 1]]+Tabell24[[#This Row],[Vxr2]]","v":0}]
[null,"Paneler",0,{"$f":"IF(Indata!C15=\"J\",$P$69,0)","v":0},{"$f":"IF(Indata!C24=\"J\",$Q$69,0)","v":0}," "," ",{"$nulls":7},"AFORE 17,0 KW",{"$f":"IF(Indata!$M$37=Tabell24[[#This Row],[DC-BOX]],Indata!$Q$37)","v":false},{"$f":"IF(Tabell24[[#This Row],[Vxr 1]]=FALSE,0,P9)","v":0},{"$f":"IF(Indata!$M$38=Tabell24[[#This Row],[DC-BOX]],Indata!$Q$38)","v":false},{"$f":"IF(Tabell24[[#This Row],[Vxr2]]=FALSE,0,R9)","v":0},0,0,{"$f":"Tabell24[[#This Row],[Vxr 1]]+Tabell24[[#This Row],[Vxr2]]","v":0}]
[null,"Skarv",0,{"$f":"IF(Indata!C15=\"J\",D8,0)","v":0},{"$f":"IF(Indata!C24=\"J\",E8,0)","v":0},{"$nulls":9},"AFORE 20,0 KW",{"$f":"IF(Indata!$M$37=Tabell24[[#This Row],[DC-BOX]],Indata!$Q$37)","v":false},{"$f":"IF(Tabell24[[#This Row],[Vxr 1]]=FALSE,0,P10)","v":0},{"$f":"IF(Indata!$M$38=Tabell24[[#This Row],[DC-BOX]],Indata!$Q$38)","v":false},{"$f":"IF(Tabell24[[#This Row],[Vxr2]]=FALSE,0,R10)","v":0},0,{"$f":"(Tabell24[[#This Row],[Vxr 1]]+Tabell24[[#This Row],[Vxr2]])*2","v":0},{"$f":"Tabell24[[#This Row],[Box1]]+Tabell24[[#This Row],[Box2]]","v":0},null,null,"Antal ändar skena x 2"]
{"$rows_left_out":82}
{"sheet":"Beräkningar","index":15,"n_rows":95,"n_cols":31,"rows_kept":95,"cut":false,"hidden":true,"merged":[]}
[null," "]
[null,null,"Billma AB   Prislistor"]
[null,null,"Lev.villkor   EXW",{"$nulls":5},1,null,"Tak nr 1.",{"$f":"IF(Indata!C15=\"J\",1,\"\")","v":1},"Mont.typ",{"$f":"Tabell4[[#Totals],[Tak 1]]","v":5},{"$nulls":7},"Kundtyp",{"$f":"Formler!X16","v":3}]
[null,null,"Moms tillkommer på alla priser",{"$nulls":7},"Tak nr 2.",{"$f":"IF(Indata!C24=\"J\",2,\"\")","v":""},"Mont.typ",{"$f":"Tabell4[[#Totals],[Tak 2]]","v":6},{"$nulls":7},"Rabatt",0,"ej i bruk"]
[]
[null,null,"Produkter och detaljer",{"$nulls":23}," "]
[{"$nulls":9},"Justering antal",{"$nulls":4}," ",{"$nulls":11}," "," "]
[null,"Ej noll","Artikelnr.","Benämning","Materialtyp","Grönt1","Grönt2","Grönt3","Tak 1","Tak 2","Kalkyl","Ändring","Antal","IKP","% ES","ES-pris","Netto ES","% ÅF","Pris ÅF","Netto ÅF","Pris.gr.","% K","Pris K","Netto kons","Kolumn5","Bruttopris","Pris efter rabatt","Totalt pris","14,55%","48,50%"]
[null,{"$f":"IF(M9<1,\"\",MAX(B$1:B8)+1)","v":""},"1010001-005","AFORE Växelriktare 5,0 KW",1,0,{"$f":"IF(Indata!$D$11=\"Ja\",19.37,0)","v":19.37},{"$f":"Tabell8[[#This Row],[Grönt1]]+G9","v":19.37},null,null,{"$f":"Formler!Q3+Formler!S3","v":0},{"$f":"'Ändringar-Kompletteringar'!E8","v":0},{"$f":"Tabell8[[#This Row],[Kalkyl]]+Tabell8[[#This Row],[Ändring]]","v":0},6315," ",9598.7999999999993,{"$f":"P9-N9","v":3283.7999999999993}," ",10483,{"$f":"S9-N9","v":4168},5,{"$f":"IF(Indata!$D$10=\"BUTP\",Anpassning!$E$5+Beräkningar!$I$3,$I$3)","v":1},{"$f":"Tabell8[[#This Row],[Pris ÅF]]*Tabell8[[#This Row],[% K]]","v":10483},{"$f":"W9-N9","v":4168},{"$f":"IFERROR(IF($W$3=1,Tabell8[[#This Row],[IKP]],IF($W$3=2,Tabell8[[#This Row],[ES-pris]],IF($W$3=3,Tabell8[[#This Row],[Pris ÅF]],IF($W$3=4,Tabell8[[#This Row],[Pris K]])))),)","v":10483},{"$f":"Tabell8[[#This Row],[Antal]]*Tabell8[[#This Row],[Kolumn5]]","v":0},{"$f":"Y9+(Y9*$W$4/100)","v":10483},{"$f":"Tabell8[[#This Row],[Antal]]*Tabell8[[#This Row],[Pris efter rabatt]]","v":0},{"$f":"IF(Tabell8[[#This Row],[Grönt2]]=19.37,Tabell8[[#This Row],[Totalt pris]],0)","v":0},{"$f":"IF(Tabell8[[#This Row],[Grönt1]]=48.5,Tabell8[[#This Row],[Totalt pris]],0)","v":0}]
[null,{"$f":"IF(M10<1,\"\",MAX(B$1:B9)+1)","v":""},"1010001-006","AFORE Växelriktare 6,0 KW",1,0,{"$f":"IF(Indata!$D$11=\"Ja\",19.37,0)","v":19.37},{"$f":"Tabell8[[#This Row],[Grönt1]]+G10","v":19.37},null,null,{"$f":"Formler!Q4+Formler!S4","v":0},{"$f":"'Ändringar-Kompletteringar'!E9","v":0},{"$f":"Tabell8[[#This Row],[Kalkyl]]+Tabell8[[#This Row],[Ändring]]","v":0},6734," ",10168.34,{"$f":"P10-N10","v":3434.34}," ",11179,{"$f":"S10-N10","v":4445},5,{"$f":"IF(Indata!$D$10=\"BUTP\",Anpassning!$E$5+Beräkningar!$I$3,$I$3)","v":1},{"$f":"Tabell8[[#This Row],[Pris ÅF]]*Tabell8[[#This Row],[% K]]","v":11179},{"$f":"W10-N10","v":4445},{"$f":"IFERROR(IF($W$3=1,Tabell8[[#This Row],[IKP]],IF($W$3=2,Tabell8[[#This Row],[ES-pris]],IF($W$3=3,Tabell8[[#This Row],[Pris ÅF]],IF($W$3=4,Tabell8[[#This Row],[Pris K]])))),)","v":11179},{"$f":"Tabell8[[#This Row],[Antal]]*Tabell8[[#This Row],[Kolumn5]]","v":0},11179,{"$f":"Tabell8[[#This Row],[Antal]]*Tabell8[[#This Row],[Pris efter rabatt]]","v":0},{"$f":"IF(Tabell8[[#This Row],[Grönt2]]=19.37,Tabell8[[#This Row],[Totalt pris]],0)","v":0},{"$f":"IF(Tabell8[[#This Row],[Grönt1]]=48.5,Tabell8[[#This Row],[Totalt pris]],0)","v":0}]
{"$rows_left_out":86}
{"sheet":"Azimut","index":16,"n_rows":33,"n_cols":28,"rows_kept":33,"cut":false,"hidden":true,"merged":[]}
[]
[]
[{"$nulls":7},"Azimut",{"$nulls":19},"Tak 1"]
[null,"Taklutning",null,"Azimut",null,null,-90,-80,-70,-60,-50,-40,-30,-20,-10,0,10,20,30,40,50,60,70,80,90,null,null,"Lutning"]
[null,0,null,-90,"Lutning",90,52,57,61,65,68,71,73,74,75,75,75,74,72,70,68,64,60,56,51,null,null,{"$f":"Indata!D20","v":25}]
[null,5,null,-80,null,85,56,61,65,69,73,75,78,79,80,80,79,78,77,75,72,68,64,60,55]
[null,10,null,-70,null,80,59,64,69,73,77,80,82,83,84,84,84,83,81,79,76,72,68,63,58,null,null,"Azimut"]
[null,15,null,-60,null,75,63,68,72,77,80,83,85,87,88,88,88,86,85,82,79,75,71,66,61,null,null,{"$f":"Indata!D21","v":0}]
[null,20,null,-50,null,70,65,71,75,80,83,86,89,90,91,91,91,90,88,85,82,79,74,70,65]
[null,25,null,-40,null,65,68,73,78,82,86,89,91,93,94,94,94,92,91,88,85,81,77,72,67,null,null,"Installerad effekt"]
{"$rows_left_out":23}